BDBM158558 US9034866, 33
SMILES CC(C)(O)C#Cc1cc2-c3nc(C(N)=O)c(C#N)n3CCOc2cc1F
InChI Key InChIKey=HUOFMAGARKGMBS-UHFFFAOYSA-N
Data  3 KI
  Tab Delimited (TSV)   2D SDfile   Computed 3D by Vconf -m prep SDfile
Find this compound or compounds like it in BindingDB:
Activity Spreadsheet -- Enzyme Inhibition Constant Data from BindingDB
Found 3 hits for monomerid = 158558
TargetMitogen-activated protein kinase kinase kinase 14(Homo sapiens (Human))
Genentech
US Patent
LigandPNGBDBM158558(US9034866, 33)
Affinity DataKi:  172nMpH: 7.2Assay Description:The ability of the nuclear factor-kappa B (NF-kB)-inducing kinase (NIK) to catalyze the hydrolysis of adenosine-5'-triphosphate (ATP) was monitored u...
In DepthDetails US Patent
TargetMitogen-activated protein kinase kinase kinase 14(Homo sapiens (Human))
Genentech
US Patent
LigandPNGBDBM158558(US9034866, 33)
Affinity DataKi:  201nM. Assay description: Inhibition of NIK (unknown origin) after 1 to 2 hrs by ADP-FP assay
In DepthDetails ArticlePubMed
LigandPNGBDBM158558(US9034866, 33)
Affinity DataKi: >1.00E+3nM. Assay description: Inhibition of N-terminal His6-tagged recombinant full-length human p110delta/untagged recombinant full length human p85alpha expressed in baculovirus...
In DepthDetails ArticlePubMed