BDBM160281 US9040691, 9
SMILES Nc1ncnn2c(cc(-c3cc(F)c(CO)c(F)c3)c12)C1(O)CCCNC1
InChI Key InChIKey=LXPMJANBDWUYCE-UHFFFAOYSA-N
Data  1 IC50
  Tab Delimited (TSV)   2D SDfile   Computed 3D by Vconf -m prep SDfile
Find this compound or compounds like it in BindingDB:
Activity Spreadsheet -- Enzyme Inhibition Constant Data from BindingDB
Found 1 hit for monomerid = 160281
TargetSerine/threonine-protein kinase receptor R3(Homo sapiens (Human))
Bayer Intellectual Property
US Patent
LigandPNGBDBM160281(US9040691, 9)
Affinity DataIC50:  5.70nM. Assay description: In vitro enzyme inhibition using scintillation of incorporated radio label (flashplate assay). Test compounds diluted in DMSO are mixed with a suitab...
In DepthDetails US Patent