BDBM160732 US9045501, 29
SMILES O=C1N(CC23CCN(CC2)CC3)Cc2n[nH]c3cccc1c23
InChI Key InChIKey=DUFOURYPCWYIEE-UHFFFAOYSA-N
Data  1 KI
  Tab Delimited (TSV)   2D SDfile   Computed 3D by Vconf -m prep SDfile
Find this compound or compounds like it in BindingDB:
Activity Spreadsheet -- Enzyme Inhibition Constant Data from BindingDB
Found 1 hit for monomerid = 160732
Target5-hydroxytryptamine receptor 3A(Homo sapiens (Human))
Albany Molecular Research
US Patent
LigandPNGBDBM160732(US9045501, 29)
Affinity DataKi:  2nM ΔG°:  -11.9kcal/molepH: 7.5 T: 2°C. Assay description: The relative affinity of the various compounds for the human 5-HT3 receptor was measured in a radioligand binding assay, using a scintillation proxim...
In DepthDetails US Patent