BDBM16320 3-({5-cyano-6-[(2,2-dimethylpropyl)(methyl)amino]pyrimidin-4-yl}amino)-N-methoxy-4-methylbenzamide::5-Cyanopyrimidine Derivative 8c
SMILES CONC(=O)c1ccc(C)c(Nc2ncnc(N(C)CC(C)(C)C)c2C#N)c1
InChI Key InChIKey=TVPNMNQKHNYGNA-UHFFFAOYSA-N
Data  1 KI
  Tab Delimited (TSV)   2D SDfile   Computed 3D by Vconf -m prep SDfile
Find this compound or compounds like it in BindingDB:
Activity Spreadsheet -- Enzyme Inhibition Constant Data from BindingDB
Found 1 hit for monomerid = 16320
TargetMitogen-activated protein kinase 14(Homo sapiens (Human))
Bristol-Myers Squibb
LigandPNGBDBM16320(3-({5-cyano-6-[(2,2-dimethylpropyl)(methyl)amino]p...)
Affinity DataKi:  0.150nM ΔG°:  -13.3kcal/molepH: 7.4 T: 2°C. Assay description: The kinase activity was determined by quantitation of the amount of radioactive phosphate transferred to myelin basic protein (MBP) with or without i...
In DepthDetails ArticlePubMed