BDBM16323 3-({5-cyano-6-[(1-methylethyl)amino]pyrimidin-4-yl}amino)-N-methoxy-4-methylbenzamide::3-{[5-cyano-6-(propan-2-ylamino)pyrimidin-4-yl]amino}-N-methoxy-4-methylbenzamide::5-Cyanopyrimidine Derivative 14c
SMILES CONC(=O)c1ccc(C)c(Nc2ncnc(NC(C)C)c2C#N)c1
InChI Key InChIKey=DEVGLXQREUCUSP-UHFFFAOYSA-N
Data  1 KI
  Tab Delimited (TSV)   2D SDfile   Computed 3D by Vconf -m prep SDfile
Find this compound or compounds like it in BindingDB:
Activity Spreadsheet -- Enzyme Inhibition Constant Data from BindingDB
Found 1 hit for monomerid = 16323
TargetMitogen-activated protein kinase 14(Homo sapiens (Human))
Bristol-Myers Squibb
LigandPNGBDBM16323(3-({5-cyano-6-[(1-methylethyl)amino]pyrimidin-4-yl...)
Affinity DataKi:  0.610nM ΔG°:  -12.4kcal/molepH: 7.4 T: 2°C. Assay description: The kinase activity was determined by quantitation of the amount of radioactive phosphate transferred to myelin basic protein (MBP) with or without i...
In DepthDetails ArticlePubMed