BDBM163970 US9062078, 101::US9475819, 101::US9637496, 101::US9695183, 101
SMILES Cc1ccc(N2CCCC2)c(n1)C(=O)N1C2CCC1C(COc1ncc(F)cn1)C2
InChI Key InChIKey=CSTPGELOUGJKMU-UHFFFAOYSA-N
Data  8 KI
  Tab Delimited (TSV)   2D SDfile   Computed 3D by Vconf -m prep SDfile
Find this compound or compounds like it in BindingDB:
Activity Spreadsheet -- Enzyme Inhibition Constant Data from BindingDB
Found 8 hits for monomerid = 163970
TargetOrexin/Hypocretin receptor type 1(Rattus norvegicus (Rat))
Janssen Pharmaceutica
US Patent
LigandPNGBDBM163970(US9062078, 101 | US9475819, 101 | US9637496, 101 |...)
Affinity DataKi:  650nM ΔG°:  -7.84kcal/moleT: 2°C. Assay description: Human Embryonic Kidney 293 cells (HEK293) stably expressing rat orexin 1 receptor (Genebank accession number NM_001525) or Chinese ovary cells (CHO) ...
In DepthDetails US Patent
TargetOrexin/Hypocretin receptor type 1(Rattus norvegicus (Rat))
Janssen Pharmaceutica
US Patent
LigandPNGBDBM163970(US9062078, 101 | US9475819, 101 | US9637496, 101 |...)
Affinity DataKi:  650nM. Assay description: Human Embryonic Kidney 293 cells (HEK293) stably expressing rat orexin 1 receptor (Genebank accession number NM_001525) or Chinese ovary cells (CHO) ...
In DepthDetails US Patent
TargetOrexin/Hypocretin receptor type 1(Rattus norvegicus (Rat))
Janssen Pharmaceutica
US Patent
LigandPNGBDBM163970(US9062078, 101 | US9475819, 101 | US9637496, 101 |...)
Affinity DataKi:  650nM ΔG°:  -7.84kcal/moleT: 2°C. Assay description: Human Embryonic Kidney 293 cells (HEK293) stably expressing rat orexin 1 receptor (Genebank accession number NM_001525) or Chinese ovary cells (CHO) ...
In DepthDetails US Patent
TargetOrexin/Hypocretin receptor type 1(Rattus norvegicus (Rat))
Janssen Pharmaceutica
US Patent
LigandPNGBDBM163970(US9062078, 101 | US9475819, 101 | US9637496, 101 |...)
Affinity DataKi:  650nM ΔG°:  -8.86kcal/moleT: 2°C. Assay description: HEK293 stably expressing human orexin 2 receptor (Genebank accession number NM001526) were grown to confluency in DMEM (Hyclone, cat #SH30022), 10% F...
In DepthDetails US Patent
TargetOrexin receptor type 2(Homo sapiens (Human))
Janssen Pharmaceutica
US Patent
LigandPNGBDBM163970(US9062078, 101 | US9475819, 101 | US9637496, 101 |...)
Affinity DataKi:  1.20E+3nM. Assay description: HEK293 stably expressing human orexin 2 receptor (Genebank accession number NM_001526) were grown to confluency in DMEM (Hyclone, cat #SH30022), 10% ...
In DepthDetails US Patent
TargetOrexin receptor type 2(Homo sapiens (Human))
Janssen Pharmaceutica
US Patent
LigandPNGBDBM163970(US9062078, 101 | US9475819, 101 | US9637496, 101 |...)
Affinity DataKi:  1.20E+3nM ΔG°:  -8.48kcal/moleT: 2°C. Assay description: HEK293 stably expressing human orexin 2 receptor (Genebank accession number NM_001526) were grown to confluency in DMEM (Hyclone, cat #SH30022), 10% ...
In DepthDetails US Patent
TargetOrexin receptor type 2(Homo sapiens (Human))
Janssen Pharmaceutica
US Patent
LigandPNGBDBM163970(US9062078, 101 | US9475819, 101 | US9637496, 101 |...)
Affinity DataKi:  1.20E+3nM ΔG°:  -8.48kcal/moleT: 2°C. Assay description: HEK293 stably expressing human orexin 2 receptor (Genebank accession number NM_001526) were grown to confluency in DMEM (Hyclone, cat # SH30022), 10%...
In DepthDetails US Patent
TargetOrexin receptor type 2(Homo sapiens (Human))
Janssen Pharmaceutica
US Patent
LigandPNGBDBM163970(US9062078, 101 | US9475819, 101 | US9637496, 101 |...)
Affinity DataKi:  1.20E+3nM ΔG°:  -8.48kcal/moleT: 2°C. Assay description: HEK293 stably expressing human orexin 2 receptor (Genebank accession number NM001526) were grown to confluency in DMEM (Hyclone, cat #SH30022), 10% F...
In DepthDetails US Patent