BDBM166197 US9067949, 54
SMILES COc1cc(cc2c3CNCCc3oc12)S(=O)(=O)c1ccccc1
InChI Key InChIKey=UXHBRWIXWMBFDK-UHFFFAOYSA-N
Data  1 KI
  Tab Delimited (TSV)   2D SDfile   Computed 3D by Vconf -m prep SDfile
Find this compound or compounds like it in BindingDB:
Activity Spreadsheet -- Enzyme Inhibition Constant Data from BindingDB
Found 1 hit for monomerid = 166197
Target5-hydroxytryptamine receptor 6(Homo sapiens (Human))
Albany Molecular Research
US Patent
LigandPNGBDBM166197(US9067949, 54)
Affinity DataKi:  0.120nM ΔG°:  -13.5kcal/molepH: 7.5 T: 2°C. Assay description: For binding analysis vs. the human receptor, samples were incubated in 50 mM Tris-HCl, pH 7.5, 5 mM MgCl2, 1 mM EDTA (4% DMSO final) with 10 nM [N-me...
In DepthDetails US Patent