BDBM171362 US9085571, Table 1, Compound 10
SMILES CCCN(C)C(=O)c1cc(NC)cc(c1)C(=O)N[C@@H](Cc1ccccc1)[C@H](O)CN(CC(C)C)S(=O)(=O)c1ccc(OC)cc1
InChI Key InChIKey=NIPBMFGYDVDWRN-AJQTZOPKSA-N
Data  2 KI
  Tab Delimited (TSV)   2D SDfile   Computed 3D by Vconf -m prep SDfile
Find this compound or compounds like it in BindingDB:
Activity Spreadsheet -- Enzyme Inhibition Constant Data from BindingDB
Found 1 hit for monomerid = 171362
TargetProtease(Human immunodeficiency virus 1 (HIV-1))
Purdue Research Foundation
US Patent
LigandPNGBDBM171362(US9085571, Table 1, Compound 10)
Affinity DataKi:  200nM. Assay description: Without being bound by theory, it is suggested that the compounds described herein may exert their utility by the inhibition of proteases encoded by ...
In DepthDetails US Patent