BDBM171371 US9085571, Table 1, Compound 19
SMILES CC(C)CN(C[C@@H](O)[C@H](Cc1ccccc1)NC(=O)c1cccc(c1)C(=O)N(C)Cc1nc(C)co1)S(=O)(=O)c1ccc(CO)cc1
InChI Key InChIKey=PQWSVCGBIGOYSI-AJQTZOPKSA-N
Data  2 KI
PDB links: 1 PDB ID matches this monomer.
  Tab Delimited (TSV)   2D SDfile   Computed 3D by Vconf -m prep SDfile
Find this compound or compounds like it in BindingDB:
Activity Spreadsheet -- Enzyme Inhibition Constant Data from BindingDB
Found 1 hit for monomerid = 171371
TargetProtease(Human immunodeficiency virus 1 (HIV-1))
Purdue Research Foundation
US Patent
LigandPNGBDBM171371(US9085571, Table 1, Compound 19)
Affinity DataKi:  0.600nM. Assay description: Without being bound by theory, it is suggested that the compounds described herein may exert their utility by the inhibition of proteases encoded by ...