BDBM172195 US9090564, 9
SMILES Cc1nccc(-c2ccc(C(=O)N3CCN(CC3)C3CCCC3)c(Cl)c2)c1C#Cc1ccc(N)nc1
InChI Key InChIKey=ZUAXILWGCPMODF-UHFFFAOYSA-N
Data  1 IC50
  Tab Delimited (TSV)   2D SDfile   Computed 3D by Vconf -m prep SDfile
Find this compound or compounds like it in BindingDB:
Activity Spreadsheet -- Enzyme Inhibition Constant Data from BindingDB
Found 1 hit for monomerid = 172195
TargetSerine/threonine-protein kinase mTOR(Homo sapiens (Human))
Boehringer Ingelheim International
US Patent
LigandPNGBDBM172195(US9090564, 9)
Affinity DataIC50:  4nMpH: 7.5 T: 2°C. Assay description: Kinase reaction conditions:400 nM GFP-4E-BP1, 8 uM ATP, -150 ng/mL mTOR, 50 mM HEPES pH 7.5, 0.01% Polysorbate 20, 1 mM EGTA, 10 mM MnC12, and variab...
In DepthDetails US Patent