BDBM17237 3-chloro-N-{4-chloro-2-[(4-chlorophenyl)carbamoyl]phenyl}-4-methylthiophene-2-carboxamide::thiophene-containing non-amidine inhibitor, 20
SMILES Cc1csc(C(=O)Nc2ccc(Cl)cc2C(=O)Nc2ccc(Cl)cc2)c1Cl
InChI Key InChIKey=YXKVUHJYIPCGRM-UHFFFAOYSA-N
Data  3 KI
  Tab Delimited (TSV)   2D SDfile   Computed 3D by Vconf -m prep SDfile
Find this compound or compounds like it in BindingDB:
Activity Spreadsheet -- Enzyme Inhibition Constant Data from BindingDB
Found 3 hits for monomerid = 17237
TargetCoagulation factor X(Homo sapiens (Human))
Berlex
LigandPNGBDBM17237(3-chloro-N-{4-chloro-2-[(4-chlorophenyl)carbamoyl]...)
Affinity DataKi:  18nM ΔG°:  -10.5kcal/molepH: 7.5 T: 2°C. Assay description: The enzyme activities were determined kinetically as the initial rate of cleavage of a peptide p-nitroanilide. Km for enzyme and substrate was determ...
In DepthDetails ArticlePubMed
TargetSerine protease 1(Bos taurus (bovine))
Berlex
LigandPNGBDBM17237(3-chloro-N-{4-chloro-2-[(4-chlorophenyl)carbamoyl]...)
Affinity DataKi: >5.00E+3nM. Assay description: The enzyme activities were determined kinetically as the initial rate of cleavage of a peptide p-nitroanilide. Km for enzyme and substrate was determ...
In DepthDetails ArticlePubMed
TargetProthrombin(Homo sapiens (Human))
Berlex
LigandPNGBDBM17237(3-chloro-N-{4-chloro-2-[(4-chlorophenyl)carbamoyl]...)
Affinity DataKi: >5.00E+3nM. Assay description: The enzyme activities were determined kinetically as the initial rate of cleavage of a peptide p-nitroanilide. Km for enzyme and substrate was determ...
In DepthDetails ArticlePubMed