BDBM17266 3-chloro-N-{4-chloro-2-[(4-chlorophenyl)carbamoyl]phenyl}-4-(1H-1,2,3,4-tetrazol-1-ylmethyl)thiophene-2-carboxamide::thiophene-containing non-amidine inhibitor, 68
SMILES Clc1c(Cn2cnnn2)csc1C(=O)Nc1ccc(Cl)cc1C(=O)Nc1ccc(Cl)cc1
InChI Key InChIKey=XAUOSNVKTOUKQA-UHFFFAOYSA-N
Data  2 KI
  Tab Delimited (TSV)   2D SDfile   Computed 3D by Vconf -m prep SDfile
Find this compound or compounds like it in BindingDB:
Activity Spreadsheet -- Enzyme Inhibition Constant Data from BindingDB
Found 2 hits for monomerid = 17266
TargetCoagulation factor X(Homo sapiens (Human))
Berlex
LigandPNGBDBM17266(3-chloro-N-{4-chloro-2-[(4-chlorophenyl)carbamoyl]...)
Affinity DataKi:  1.70nM. Assay description: The enzyme activities were determined kinetically as the initial rate of cleavage of a peptide p-nitroanilide. Km for enzyme and substrate was determ...
In DepthDetails ArticlePubMed
TargetProthrombin(Homo sapiens (Human))
Berlex
LigandPNGBDBM17266(3-chloro-N-{4-chloro-2-[(4-chlorophenyl)carbamoyl]...)
Affinity DataKi: >5.00E+3nM. Assay description: The enzyme activities were determined kinetically as the initial rate of cleavage of a peptide p-nitroanilide. Km for enzyme and substrate was determ...
In DepthDetails ArticlePubMed