BDBM173486 US9096606, 23
SMILES COc1ccc2C[C@@H]3[C@]45CC[C@](OC)([C@@H]6Oc1c2[C@]46CC[N+]3(C)CC1CC1)[C@@H](COCc1ccc(cc1)C(C)(F)F)C5
InChI Key InChIKey=YEHVCEFWELXCEG-DLSDUUAWSA-N
Data  4 KI
  Tab Delimited (TSV)   2D SDfile   Computed 3D by Vconf -m prep SDfile
Find this compound or compounds like it in BindingDB:
Activity Spreadsheet -- Enzyme Inhibition Constant Data from BindingDB
Found 4 hits for monomerid = 173486
TargetKappa-type opioid receptor(Homo sapiens (Human))
Purdue Pharma
US Patent
LigandPNGBDBM173486(US9096606, 23)
Affinity DataKi:  112nM ΔG°:  -8.81kcal/molepH: 7.4 T: 2°C. Assay description: Membranes from recombinant HEK-293 cells expressing the human kippa opioid receptor (cloned in house) were prepared by lysing cells in ice cold hypot...
In DepthDetails US Patent
TargetMu-type opioid receptor(Homo sapiens (Human))
Purdue Pharma
US Patent
LigandPNGBDBM173486(US9096606, 23)
Affinity DataKi:  262nM ΔG°:  -9.73kcal/molepH: 7.4 T: 2°C. Assay description: Radioligand dose-displacement binding assays for -opioid receptors used 0.3 nM [3H]-diprenorphine (Perkin Elmer, Shelton, Conn.), with 5 mg membrane ...
In DepthDetails US Patent
TargetOpioid growth factor receptor-like protein 1(Homo sapiens (Human))
Purdue Pharma
US Patent
LigandPNGBDBM173486(US9096606, 23)
Affinity DataKi: >2.00E+4nM ΔG°: >-5.95kcal/molepH: 7.4 T: 2°C. Assay description: Membranes from recombinant HEK-293 cells expressing the human opioid receptor-like receptor (ORL-1) (Perkin Elmer, Shelton, Conn.) were prepared by l...
In DepthDetails US Patent
TargetDelta-type opioid receptor(Homo sapiens (Human))
Purdue Pharma
US Patent
LigandPNGBDBM173486(US9096606, 23)
Affinity DataKi: >2.00E+4nMpH: 7.4Assay Description:δ-opioid Receptor Binding Assay Procedures were conducted as follows. Radioligand dose-displacement assays used 0.3 nM [3H]-Naltrindole (Perkin ...
In DepthDetails US Patent