BDBM173974 US9102637, 9
SMILES Cc1ccc(cc1N)C(=O)Nc1sc(Nc2ccc3ccccc3c2)nc1C(N)=O
InChI Key InChIKey=GOUTVBDBKUUZQG-UHFFFAOYSA-N
Data  1 IC50
  Tab Delimited (TSV)   2D SDfile   Computed 3D by Vconf -m prep SDfile
Find this compound or compounds like it in BindingDB:
Activity Spreadsheet -- Enzyme Inhibition Constant Data from BindingDB
Found 1 hit for monomerid = 173974
TargetTRAF2 and NCK-interacting protein kinase(Homo sapiens (Human))
Carna Biosciences
US Patent
LigandPNGBDBM173974(US9102637, 9)
Affinity DataIC50:  27.2nMpH: 7.5 T: 2°C. Assay description: The kinase assays were conducted in a 20 μl volume using 384-well plates (Greiner). The reaction mixture consists of compound or vehicle (1% DMS...
In DepthDetails US Patent