BDBM17417 1,2,4-Triazole Compound, 75::methyl 4-[(5-{[(2-methyl-1,3-thiazol-4-yl)methyl]sulfanyl}-4H-1,2,4-triazol-3-yl)amino]benzoate
SMILES COC(=O)c1ccc(Nc2nnc(SCc3csc(C)n3)[nH]2)cc1
InChI Key InChIKey=VZSYRVYVFRPJRK-UHFFFAOYSA-N
Data  1 KI
  Tab Delimited (TSV)   2D SDfile   Computed 3D by Vconf -m prep SDfile
Find this compound or compounds like it in BindingDB:
Activity Spreadsheet -- Enzyme Inhibition Constant Data from BindingDB
Found 1 hit for monomerid = 17417
TargetMethionine aminopeptidase 2(Homo sapiens (Human))
Gsk
LigandPNGBDBM17417(1,2,4-Triazole Compound, 75 | methyl 4-[(5-{[(2-me...)
Affinity DataKi:  3.80nM. Assay description: MetAP2 activity was monitored by measuring the initial velocity of turnover of the artificial substrate Met-AMC. Assays were performed in 96-well mi...
In DepthDetails ArticlePubMed