BDBM175153 US9115117, 55::US9611251, 55
SMILES CCOc1ccccc1C(=O)N1CCC[C@@H](Nc2ccc(cn2)C(F)(F)F)[C@H]1C
InChI Key InChIKey=AJDWPJCBXKCGQC-RHSMWYFYSA-N
Data  4 KI
  Tab Delimited (TSV)   2D SDfile   Computed 3D by Vconf -m prep SDfile
Find this compound or compounds like it in BindingDB:
Activity Spreadsheet -- Enzyme Inhibition Constant Data from BindingDB
Found 2 hits for monomerid = 175153
TargetOrexin/Hypocretin receptor type 1(Rattus norvegicus (Rat))
Janssen Pharmaceutica
US Patent
LigandPNGBDBM175153(US9115117, 55 | US9611251, 55)
Affinity DataKi:  1.20E+3nM. Assay description: Human Embryonic Kidney 293 cells (HEK293) stably expressing rat orexin 1 receptor(Genebank accession number NM_001525) or Chinese ovary cells (CHO) s...
In DepthDetails US Patent
TargetOrexin receptor type 2(Homo sapiens (Human))
Janssen Pharmaceutica
US Patent
LigandPNGBDBM175153(US9115117, 55 | US9611251, 55)
Affinity DataKi: >1.00E+4nM. Assay description: HEK293 stably expressing human orexin 2 receptor (Genebank accession numberNM_001526) were grown to confluency in DMEM (Hyclone, cat # SH30022) , 10%...
In DepthDetails US Patent