BDBM176595 US9120761, 9
SMILES CCc1cc(ccc1Nc1ncc(c(CCc2ccccc2CC(N)=O)n1)C(F)(F)F)C1CCN(C)CC1
InChI Key InChIKey=SXMOIWLLBKAOGR-UHFFFAOYSA-N
Data  2 IC50  1 Kd
  Tab Delimited (TSV)   2D SDfile   Computed 3D by Vconf -m prep SDfile
Find this compound or compounds like it in BindingDB:
Activity Spreadsheet -- Enzyme Inhibition Constant Data from BindingDB
Found 3 hits for monomerid = 176595
TargetFocal adhesion kinase 1(Mus musculus (Mouse))
Cancer Therapeutics Crc
US Patent
LigandPNGBDBM176595(US9120761, 9)
Affinity DataIC50:  3.60nMpH: 7.4Assay Description:A biotin labeled peptide is used as substrate (amino acid sequence: Biotin-Glu-Gly-Pro-Trp-Leu-Glu-Glu-Glu-Glu-Glu-Ala-Tyr-Gly-Trp-Met-Asp-Phe-NH2) S...
In DepthDetails US Patent
TargetFocal adhesion kinase 1(Mus musculus (Mouse))
Cancer Therapeutics Crc
US Patent
LigandPNGBDBM176595(US9120761, 9)
Affinity DataKd:  1.5nMpH: 7.4Assay Description:In running buffer (0.01 M HEPES pH 7.4, 0.15 M NaCl, 0.005% Surfactant P20, mM MgCl2, and 1% DMSO)N-terminally GST-fused purified FAK enzyme was capt...
In DepthDetails US Patent
TargetIsoform 2 of Vascular endothelial growth factor receptor 3 (Short) 98-1298](Homo sapiens (Human))
Cancer Therapeutics Crc
US Patent
LigandPNGBDBM176595(US9120761, 9)
Affinity DataIC50:  1.01E+3nMpH: 7.4Assay Description:Compounds of the invention may be tested for in vitro activity in the following assay: A biotin labeled peptide is used as substrate (amino acid sequ...
In DepthDetails US Patent