BDBM17742 2,6-dimethylphenyl N-(2,4-dimethoxyphenyl)-N-[2-({4-[3-(piperidin-1-yl)propoxy]phenyl}amino)pyrimidin-4-yl]carbamate::2-aminopyrimidine carbamate, 41
SMILES COc1ccc(N(C(=O)Oc2c(C)cccc2C)c2ccnc(Nc3ccc(OCCCN4CCCCC4)cc3)n2)c(OC)c1
InChI Key InChIKey=CQKMMXFWQMPMFC-UHFFFAOYSA-N
Data  4 IC50
  Tab Delimited (TSV)   2D SDfile   Computed 3D by Vconf -m prep SDfile
Find this compound or compounds like it in BindingDB:
Activity Spreadsheet -- Enzyme Inhibition Constant Data from BindingDB
Found 4 hits for monomerid = 17742
TargetTyrosine-protein kinase Lck(Homo sapiens (Human))
Amgen
LigandPNGBDBM17742(2,6-dimethylphenyl N-(2,4-dimethoxyphenyl)-N-[2-({...)
Affinity DataIC50:  1nMpH: 7.5 T: 2°C. Assay description: The assay involves the phosphorylation of a biotinylated substrate and the detection of this phosphorylation after the addition of a streptavidin-all...
In DepthDetails ArticlePubMed
TargetVascular endothelial growth factor receptor 2(Homo sapiens (Human))
Amgen
LigandPNGBDBM17742(2,6-dimethylphenyl N-(2,4-dimethoxyphenyl)-N-[2-({...)
Affinity DataIC50:  350nM. Assay description: The assay involves the phosphorylation of a biotinylated substrate and the detection of this phosphorylation after the addition of a streptavidin-all...
In DepthDetails ArticlePubMed
TargetMitogen-activated protein kinase 14(Homo sapiens (Human))
Amgen
LigandPNGBDBM17742(2,6-dimethylphenyl N-(2,4-dimethoxyphenyl)-N-[2-({...)
Affinity DataIC50:  3.20E+3nM. Assay description: The assay involves the phosphorylation of a biotinylated substrate and the detection of this phosphorylation after the addition of a streptavidin-all...
In DepthDetails ArticlePubMed
TargetProto-oncogene tyrosine-protein kinase Src(Homo sapiens (Human))
Amgen
LigandPNGBDBM17742(2,6-dimethylphenyl N-(2,4-dimethoxyphenyl)-N-[2-({...)
Affinity DataIC50:  7nM. Assay description: The assay involves the phosphorylation of a biotinylated substrate and the detection of this phosphorylation after the addition of a streptavidin-all...
In DepthDetails ArticlePubMed