BDBM17800 benzimidazole-acetamide, 28::methyl N-[6-(4-{2-[3-(trifluoromethyl)phenyl]acetamido}phenoxy)-1H-1,3-benzodiazol-2-yl]carbamate
SMILES COC(=O)Nc1nc2ccc(Oc3ccc(NC(=O)Cc4cccc(c4)C(F)(F)F)cc3)cc2[nH]1
InChI Key InChIKey=RPRXZJJRLZUSAZ-UHFFFAOYSA-N
Data  1 IC50
  Tab Delimited (TSV)   2D SDfile   Computed 3D by Vconf -m prep SDfile
Find this compound or compounds like it in BindingDB:
Activity Spreadsheet -- Enzyme Inhibition Constant Data from BindingDB
Found 1 hit for monomerid = 17800
TargetAngiopoietin-1 receptor(Homo sapiens (Human))
Gsk
LigandPNGBDBM17800(benzimidazole-acetamide, 28 | methyl N-[6-(4-{2-[3...)
Affinity DataIC50:  3.20E+3nMpH: 7.4 T: 2°C. Assay description: The assay uses purified GST-Tie-2 or GST-VEGFR2 interacting with biotinylated peptide substrates. HTRF is based on the proximity of europium cryptate...
In DepthDetails ArticlePubMed