BDBM17823 N-{6-[4-({[2-fluoro-5-(trifluoromethyl)phenyl]carbamoyl}amino)phenoxy]-1H-1,3-benzodiazol-2-yl}-2-(2-methoxyethoxy)acetamide::benzimidazole-urea, 51
SMILES COCCOCC(=O)Nc1nc2ccc(Oc3ccc(NC(=O)Nc4cc(ccc4F)C(F)(F)F)cc3)cc2[nH]1
InChI Key InChIKey=NFUYWPLTEOKUJO-UHFFFAOYSA-N
Data  2 IC50
  Tab Delimited (TSV)   2D SDfile   Computed 3D by Vconf -m prep SDfile
Find this compound or compounds like it in BindingDB:
Activity Spreadsheet -- Enzyme Inhibition Constant Data from BindingDB
Found 2 hits for monomerid = 17823
TargetVascular endothelial growth factor receptor 2(Homo sapiens (Human))
Gsk
LigandPNGBDBM17823(N-{6-[4-({[2-fluoro-5-(trifluoromethyl)phenyl]carb...)
Affinity DataIC50:  5.40nM. Assay description: The assay uses purified GST-Tie-2 or GST-VEGFR2 interacting with biotinylated peptide substrates. HTRF is based on the proximity of europium cryptate...
In DepthDetails ArticlePubMed
TargetAngiopoietin-1 receptor(Homo sapiens (Human))
Gsk
LigandPNGBDBM17823(N-{6-[4-({[2-fluoro-5-(trifluoromethyl)phenyl]carb...)
Affinity DataIC50:  3nM. Assay description: The assay uses purified GST-Tie-2 or GST-VEGFR2 interacting with biotinylated peptide substrates. HTRF is based on the proximity of europium cryptate...
In DepthDetails ArticlePubMed