BDBM181079 2-(4-(benzo[d]thiazol-2-yl)benzoyl)-N-(p-tolyl)hydrazinecarbothioamide (5)
SMILES Cc1ccc(NC(=S)NNC(=O)c2ccc(cc2)-c2nc3ccccc3s2)cc1
InChI Key InChIKey=KKSGTYQQZYHRDO-UHFFFAOYSA-N
Data  1 IC50
  Tab Delimited (TSV)   2D SDfile   Computed 3D by Vconf -m prep SDfile
Find this compound or compounds like it in BindingDB:
Activity Spreadsheet -- Enzyme Inhibition Constant Data from BindingDB
Found 1 hit for monomerid = 181079
TargetUrease(Canavalia ensiformis (Jack bean) (Horse bean))
Universiti Teknologi Mara (Uitm), Puncak Alam Campus
LigandPNGBDBM181079(2-(4-(benzo[d]thiazol-2-yl)benzoyl)-N-(p-tolyl)hyd...)
Affinity DataIC50:  1.04E+4nMpH: 6.8 T: 2°C. Assay description: To understand the binding modes of the compounds given in Table 1, all ligands were docked into the binding site of Urease enzyme. The top ranked con...
In DepthDetails ArticlePubMed