BDBM181094 2-(4-(benzo[d]thiazol-2-yl)benzoyl)-N-phenylhydrazinecarbothioamide (20)
SMILES O=C(NNC(=S)Nc1ccccc1)c1ccc(cc1)-c1nc2ccccc2s1
InChI Key InChIKey=FYMGWVWIJDKTBN-UHFFFAOYSA-N
Data  1 IC50
  Tab Delimited (TSV)   2D SDfile   Computed 3D by Vconf -m prep SDfile
Find this compound or compounds like it in BindingDB:
Activity Spreadsheet -- Enzyme Inhibition Constant Data from BindingDB
Found 1 hit for monomerid = 181094
TargetUrease(Canavalia ensiformis (Jack bean) (Horse bean))
Universiti Teknologi Mara (Uitm), Puncak Alam Campus
LigandPNGBDBM181094(2-(4-(benzo[d]thiazol-2-yl)benzoyl)-N-phenylhydraz...)
Affinity DataIC50:  1.91E+4nMpH: 6.8 T: 2°C. Assay description: To understand the binding modes of the compounds given in Table 1, all ligands were docked into the binding site of Urease enzyme. The top ranked con...
In DepthDetails ArticlePubMed