BDBM181125 US9138393, Erythromycin
SMILES CCCOC(=O)[C@H](C)[C@@H](O[C@H]1C[C@@](C)(OC)[C@@H](O)[C@H](C)O1)[C@H](C)[C@@H](O[C@H](OC(C)C)[C@H](O)CN(C)C)[C@](C)(O)C[C@@H](C)C(O)[C@H](C)[C@@H](O)[C@H](C)O
InChI Key InChIKey=JHAIJJRAVZIJPG-FFLIERHOSA-N
Data  1 IC50
  Tab Delimited (TSV)   2D SDfile   Computed 3D by Vconf -m prep SDfile
Find this compound or compounds like it in BindingDB:
Activity Spreadsheet -- Enzyme Inhibition Constant Data from BindingDB
Found 1 hit for monomerid = 181125
TargetCytochrome P450 3A4(Homo sapiens (Human))
The Procter & Gamble
US Patent
LigandPNGBDBM181125(US9138393, Erythromycin)
Affinity DataIC50: >1.00E+4nM. Assay description: A commercially available P450-GLO Assay kit (Promega Corporation, Madison Wis.) is used to screen various compounds for CYP3A4A inhibition activity. ...
Ligand InfoPC cidPC sid
In DepthDetails US Patent