BDBM181777 US9139593, 9
SMILES Clc1ccc(cc1)S(=O)(=O)N1CCC11CN(C1)C(=O)NCCCc1ccccc1
InChI Key InChIKey=OQZMCJZKCJUBNL-UHFFFAOYSA-N
Data  1 IC50
  Tab Delimited (TSV)   2D SDfile   Computed 3D by Vconf -m prep SDfile
Find this compound or compounds like it in BindingDB:
Activity Spreadsheet -- Enzyme Inhibition Constant Data from BindingDB
Found 1 hit for monomerid = 181777
TargetBifunctional epoxide hydrolase 2(Homo sapiens (Human))
Hoffmann-La Roche
US Patent
LigandPNGBDBM181777(US9139593, 9)
Affinity DataIC50:  1.99E+3nMpH: 7.0 T: 2°C. Assay description: Test compounds (1.6 mM stock in DMSO) were diluted 3 fold in series in DMSO and 0.8 microliters per well were added into 384-well NBS microplates (Co...
In DepthDetails US Patent