BDBM181806 US9145380, 9
SMILES C\C(=C/c1ccc(Cl)cc1)S(=O)(=O)Nc1ccccc1S(N)(=O)=O
InChI Key InChIKey=RLJRHWYXJQHCIL-ZHACJKMWSA-N
Data  1 IC50
  Tab Delimited (TSV)   2D SDfile   Computed 3D by Vconf -m prep SDfile
Find this compound or compounds like it in BindingDB:
Activity Spreadsheet -- Enzyme Inhibition Constant Data from BindingDB
Found 1 hit for monomerid = 181806
TargetProstaglandin E synthase 2(Homo sapiens (Human))
Astrazeneca
US Patent
LigandPNGBDBM181806(US9145380, 9)
Affinity DataIC50:  610nMpH: 6.8Assay Description:A solution of test compound was added to a diluted microsome preparation containing human mPGES-1 and pre-incubated for 15 minutes in potassium phosp...
In DepthDetails US Patent