BDBM188380 US9169224, 68
SMILES O=C(Nc1ccccc1)N1CCN(Cc2ccc3ccc4cccc5ccc2c3c45)CC1
InChI Key InChIKey=ULKPJSOZTZPHHP-UHFFFAOYSA-N
Data  2 IC50
  Tab Delimited (TSV)   2D SDfile   Computed 3D by Vconf -m prep SDfile
Find this compound or compounds like it in BindingDB:
Activity Spreadsheet -- Enzyme Inhibition Constant Data from BindingDB
Found 2 hits for monomerid = 188380
TargetFatty-acid amide hydrolase 1(Homo sapiens (Human))
Janssen Pharmaceutica
US Patent
LigandPNGBDBM188380(US9169224, 68)
Affinity DataIC50:  610nMpH: 9.0Assay Description:T84 frozen cell pellets or transfected SK-N-MC cells (contents of 1x15 cm culture dishes) were homogenized in 50 mL of FAAH assay buffer (125 mM Tris...
In DepthDetails US Patent
TargetFatty-acid amide hydrolase 1(Homo sapiens (Human))
Janssen Pharmaceutica
US Patent
LigandPNGBDBM188380(US9169224, 68)
Affinity DataIC50:  95nMpH: 9.0Assay Description:Assay Method 1: T84 frozen pellets (contents of 1-4x15 cm culture dishes) were homogenized in 300 mL of FAAH assay buffer (125 mM Tris, 1 mM EDTA, 0....
In DepthDetails US Patent