BDBM188445 US9169224, 134
SMILES CS(=O)(=O)c1ccc(Oc2cccc(CN3CCN(CC3)C(=O)Nc3ccccc3)c2)cc1
InChI Key InChIKey=GUWWQFUMAGRQBA-UHFFFAOYSA-N
Data  1 IC50
  Tab Delimited (TSV)   2D SDfile   Computed 3D by Vconf -m prep SDfile
Find this compound or compounds like it in BindingDB:
Activity Spreadsheet -- Enzyme Inhibition Constant Data from BindingDB
Found 1 hit for monomerid = 188445
TargetFatty-acid amide hydrolase 1(Homo sapiens (Human))
Janssen Pharmaceutica
US Patent
LigandPNGBDBM188445(US9169224, 134)
Affinity DataIC50:  65nMpH: 9.0Assay Description:Assay Method 1: T84 frozen pellets (contents of 1-4x15 cm culture dishes) were homogenized in 300 mL of FAAH assay buffer (125 mM Tris, 1 mM EDTA, 0....
Ligand InfoPC cidPC sid
In DepthDetails US Patent