BDBM188446 US9169224, 135
SMILES COc1cccc(Oc2cccc(CN3CCN(CC3)C(=O)Nc3ccccc3)c2)c1
InChI Key InChIKey=UOSBCCJPCITERF-UHFFFAOYSA-N
Data  1 IC50
  Tab Delimited (TSV)   2D SDfile   Computed 3D by Vconf -m prep SDfile
Find this compound or compounds like it in BindingDB:
Activity Spreadsheet -- Enzyme Inhibition Constant Data from BindingDB
Found 1 hit for monomerid = 188446
TargetFatty-acid amide hydrolase 1(Homo sapiens (Human))
Janssen Pharmaceutica
US Patent
LigandPNGBDBM188446(US9169224, 135)
Affinity DataIC50:  83nMpH: 9.0Assay Description:Assay Method 1: T84 frozen pellets (contents of 1-4x15 cm culture dishes) were homogenized in 300 mL of FAAH assay buffer (125 mM Tris, 1 mM EDTA, 0....
In DepthDetails US Patent