BDBM190028 US9175003, 189
SMILES CC[C@H](N1Cc2cc3O[C@H](COc3cc2C[C@H]1C(=O)N[C@@H](Cc1ccc(Oc2ccnc(C)c2C)cc1)C(O)=O)c1ccc(OCc2ccc(Cl)c(Cl)c2)cc1)c1ccccc1
InChI Key InChIKey=ADSVWDKBZTUAQI-PZEVNQBWSA-N
Data  1 EC50
  Tab Delimited (TSV)   2D SDfile   Computed 3D by Vconf -m prep SDfile
Find this compound or compounds like it in BindingDB:
Activity Spreadsheet -- Enzyme Inhibition Constant Data from BindingDB
Found 1 hit for monomerid = 190028
TargetGlucagon-like peptide 1 receptor(Homo sapiens (Human))
Vtv Therapeutics
US Patent
LigandPNGBDBM190028(US9175003, 189)
Affinity DataEC50:  31nM. Assay description: The efficacy of GLP-1 receptor agonists was studied in a cAMP functional assay using HEK-293 Cells expressing the cloned human GLP-1 receptor. GLP-1-...
In DepthDetails US Patent