BDBM1938 (2S,3R)-2-({3-[1-(4-hydroxy-2-oxo-2H-chromen-3-yl)propyl]phenyl}formamido)-3-methyl-N-(pyridin-2-ylmethyl)pentanamide::3-[1-(4-Hydroxy-2-oxo-2H-1-benzopyran-3-yl)propyl]-N-[2-methyl-1-[[(2-pyridinylmethyl)amino]carbonyl]butyl]benzamide::Alternate Carboxamide-Containing Phenprocoumon deriv. XIX
SMILES CCC(C)[C@H](NC(=O)c1cccc(c1)C(CC)c1c(O)c2ccccc2oc1=O)C(=O)NCc1ccccn1
InChI Key InChIKey=QIHKVSBIWBQSSB-VUDGLICPSA-N
Data  1 KI
  Tab Delimited (TSV)   2D SDfile   Computed 3D by Vconf -m prep SDfile
Find this compound or compounds like it in BindingDB:
Activity Spreadsheet -- Enzyme Inhibition Constant Data from BindingDB
Found 1 hit for monomerid = 1938
TargetDimer of Gag-Pol polyprotein [489-587](Human immunodeficiency virus type 1)
Upjohn
LigandPNGBDBM1938((2S,3R)-2-({3-[1-(4-hydroxy-2-oxo-2H-chromen-3-yl)...)
Affinity DataKi:  400nM ΔG°:  -8.63kcal/molepH: 5.0 T: 2°C. Assay description: HIV-1 protease was purified and refolded from E. coli inclusion bodies. The substrate used spans the p17-p24 processing site (R-V-S-Q-N-Y-P-I-V-Q-N-K...
Ligand InfoPC cidPC sid
In DepthDetails ArticlePubMed