BDBM194270 US9199999, 8
SMILES CC(C)(O)C#Cc1cn2c(cnc2c(NCCCCO)n1)-c1ccc(cc1)C(=O)NC1CC1
InChI Key InChIKey=YCKPEFHLYWVLJA-UHFFFAOYSA-N
Data  1 IC50
  Tab Delimited (TSV)   2D SDfile   Computed 3D by Vconf -m prep SDfile
Find this compound or compounds like it in BindingDB:
Activity Spreadsheet -- Enzyme Inhibition Constant Data from BindingDB
Found 1 hit for monomerid = 194270
TargetDual specificity protein kinase TTK(Homo sapiens (Human))
Bayer Intellectual Property
US Patent
LigandPNGBDBM194270(US9199999, 8)
Affinity DataIC50:  22nMpH: 7.7 T: 2°C. Assay description: N-terminally GST-tagged human full length recombinant Mps-1 kinase (purchased from Invitrogen, Karslruhe, Germany, cat. no PV4071 ) was used. As subs...
In DepthDetails US Patent