BDBM194318 US9199999, 56
SMILES OCCCCNc1nc(cn2c(cnc12)-c1ccc(cc1)-c1cnc([nH]1)C1CC1)C#CCO
InChI Key InChIKey=MMOMUAYEDFRYSJ-UHFFFAOYSA-N
Data  1 IC50
  Tab Delimited (TSV)   2D SDfile   Computed 3D by Vconf -m prep SDfile
Find this compound or compounds like it in BindingDB:
Activity Spreadsheet -- Enzyme Inhibition Constant Data from BindingDB
Found 1 hit for monomerid = 194318
TargetDual specificity protein kinase TTK(Homo sapiens (Human))
Bayer Intellectual Property
US Patent
LigandPNGBDBM194318(US9199999, 56)
Affinity DataIC50:  23nMpH: 7.7 T: 2°C. Assay description: N-terminally GST-tagged human full length recombinant Mps-1 kinase (purchased from Invitrogen, Karslruhe, Germany, cat. no PV4071 ) was used. As subs...
In DepthDetails US Patent