BDBM194593 US9206129, 9
SMILES Nc1c(cc(c2ccccc12)S(=O)(=O)O[Na])\N=N\c1ccc(nc1)-c1ccc(Cl)cc1Cl
InChI Key InChIKey=DNNHIPMNRDALND-JGUILPGDSA-M
Data  1 IC50
  Tab Delimited (TSV)   2D SDfile   Computed 3D by Vconf -m prep SDfile
Find this compound or compounds like it in BindingDB:
Activity Spreadsheet -- Enzyme Inhibition Constant Data from BindingDB
Found 1 hit for monomerid = 194593
TargetTransitional endoplasmic reticulum ATPase(Mus musculus (Mouse))
Daito Chemix
US Patent
LigandPNGBDBM194593(US9206129, 9)
Affinity DataIC50:  178nMpH: 8.0 T: 2°C. Assay description: Mouse VCP cDNA was added with a DNA sequence corresponding to histidine tag at the amino-terminal, subcloned into a baculovirus vector pVL1392 (BD Bi...
Ligand InfoPC cidPC sid
In DepthDetails US Patent