BDBM19500 (2R)-N-(1-cyanocyclopropyl)-3-[(2-methylpropane)sulfonyl]-2-{[(1S)-2,2,2-trifluoro-1-(4-fluorophenyl)ethyl]amino}propanamide::trifluoroethylamine inhibitor, 10
SMILES CC(C)CS(=O)(=O)C[C@H](N[C@@H](c1ccc(F)cc1)C(F)(F)F)C(=O)NC1(CC1)C#N
InChI Key InChIKey=SLSHNBKPDGBYGO-HOTGVXAUSA-N
Data  4 IC50
  Tab Delimited (TSV)   2D SDfile   Computed 3D by Vconf -m prep SDfile
Find this compound or compounds like it in BindingDB:
Activity Spreadsheet -- Enzyme Inhibition Constant Data from BindingDB
Found 4 hits for monomerid = 19500
TargetCathepsin S(Homo sapiens (Human))
Merck Frosst Centre For Therapeutic Research
LigandPNGBDBM19500((2R)-N-(1-cyanocyclopropyl)-3-[(2-methylpropane)su...)
Affinity DataIC50:  0.400nMpH: 6.5 T: 2°C. Assay description: Prior to the addition of substrate, different concentrations of the inhibitor ranging from 100 uM to 0.2 nM were preincubated for 15 min with enzyme ...
In DepthDetails ArticlePubMed
TargetProcathepsin L(Homo sapiens (Human))
Merck Frosst Centre For Therapeutic Research
LigandPNGBDBM19500((2R)-N-(1-cyanocyclopropyl)-3-[(2-methylpropane)su...)
Affinity DataIC50:  132nM. Assay description: Prior to the addition of substrate, different concentrations of the inhibitor ranging from 100 uM to 0.2 nM were preincubated for 15 min with enzyme ...
In DepthDetails ArticlePubMed
TargetCathepsin K(Oryctolagus cuniculus (rabbit))
Merck Frosst Centre For Therapeutic Research
LigandPNGBDBM19500((2R)-N-(1-cyanocyclopropyl)-3-[(2-methylpropane)su...)
Affinity DataIC50:  3.06E+3nM. Assay description: Prior to the addition of substrate, different concentrations of the inhibitor ranging from 100 uM to 0.2 nM were preincubated for 15 min with enzyme ...
In DepthDetails ArticlePubMed
TargetCathepsin B(Homo sapiens (Human))
Merck Frosst Centre For Therapeutic Research
LigandPNGBDBM19500((2R)-N-(1-cyanocyclopropyl)-3-[(2-methylpropane)su...)
Affinity DataIC50:  337nM. Assay description: Prior to the addition of substrate, different concentrations of the inhibitor ranging from 100 uM to 0.2 nM were preincubated for 15 min with enzyme ...
In DepthDetails ArticlePubMed