BDBM195323 US9670212, 39 3-amino-N-[(8-methyl-2-{methyl[(1-methylpiperidin-2-yl)methyl]amino}quinolin-3-yl)methyl]pyrazine-2-carboxamide
SMILES CN(CC1CCCCN1C)c1nc2c(C)cccc2cc1CNC(=O)c1nccnc1N
InChI Key InChIKey=JLNXSZNCUOAORC-UHFFFAOYSA-N
Data  1 IC50
  Tab Delimited (TSV)   2D SDfile   Computed 3D by Vconf -m prep SDfile
Find this compound or compounds like it in BindingDB:
Activity Spreadsheet -- Enzyme Inhibition Constant Data from BindingDB
Found 1 hit for monomerid = 195323
LigandPNGBDBM195323(US9670212, 39 3-amino-N-[(8-methyl-2-{methyl[(1-me...)
Affinity DataIC50: <50nM. Assay description: Kinase activity is measured as the percent of ATP consumed following the kinase reaction using luciferase-luciferin-coupled chemiluminescence. Reacti...
Ligand InfoPC cidPC sid
In DepthDetails US Patent