BDBM195621 US9206173, 9
SMILES COn1c(N[C@@H](C)c2ccc(Cl)cc2)nc2CCN(Cc2c1=O)C(=O)c1ccc(Cl)cc1
InChI Key InChIKey=WOMVDTYTOSGQKS-AWEZNQCLSA-N
Data  1 KI  1 IC50
  Tab Delimited (TSV)   2D SDfile   Computed 3D by Vconf -m prep SDfile
Find this compound or compounds like it in BindingDB:
Activity Spreadsheet -- Enzyme Inhibition Constant Data from BindingDB
Found 2 hits for monomerid = 195621
TargetProlactin-releasing peptide receptor(Homo sapiens (Human))
Otsuka Pharmaceutical
US Patent
LigandPNGBDBM195621(US9206173, 9)
Affinity DataKi:  28nM ΔG°:  -10.3kcal/molepH: 7.4 T: 2°C. Assay description: Receptor-expressing HEK 293 cell membrane fraction was analyzed by modifying the methods of C. J. Langmead et al. (see Langmead C J, Szekeres P G; Ch...
Ligand InfoPC cidPC sid
In DepthDetails US Patent
TargetProlactin-releasing peptide receptor(Homo sapiens (Human))
Otsuka Pharmaceutical
US Patent
LigandPNGBDBM195621(US9206173, 9)
Affinity DataIC50:  204nMpH: 7.4 T: 2°C. Assay description: HEK293 cells expressing human GPR10 were maintained in Dulbecco's Modified Eagles' medium supplemented with 10% fetal bovine serum, 1% penici...
Ligand InfoPC cidPC sid
In DepthDetails US Patent