BDBM197542 US9216968, 142::US9732066, 142
SMILES Cc1c(Cl)cccc1NC(=O)c1cc(NC(=O)c2ccccc2C(F)(F)F)cc2[nH]c(nc12)N1CCCCC1
InChI Key InChIKey=OPVQIICDXACXNE-UHFFFAOYSA-N
Data  2 IC50
  Tab Delimited (TSV)   2D SDfile   Computed 3D by Vconf -m prep SDfile
Find this compound or compounds like it in BindingDB:
Activity Spreadsheet -- Enzyme Inhibition Constant Data from BindingDB
Found 2 hits for monomerid = 197542
TargetProstaglandin E synthase(Homo sapiens (Human))
Nippon Shinyaku
US Patent
LigandPNGBDBM197542(US9216968, 142 | US9732066, 142)
Affinity DataIC50:  0.400nM. Assay description: mPGES-1 microsome fractions were prepared from CHO-K1 cells transiently transfected with plasmid encoding the human mPGES-1cDNA. Microsomes were dilu...
Ligand InfoPC cidPC sid
In DepthDetails US Patent
TargetProstaglandin E synthase(Homo sapiens (Human))
Nippon Shinyaku
US Patent
LigandPNGBDBM197542(US9216968, 142 | US9732066, 142)
Affinity DataIC50:  0.400nM. Assay description: mPGES-1 microsome fractions were prepared from CHO-K1 cells transiently transfected with plasmid encoding the human mPGES-1cDNA. Microsomes were dilu...
Ligand InfoPC cidPC sid
In DepthDetails US Patent