BDBM20127 phenylalanine derived allylamide, 55::tert-butyl N-[(1S)-2-phenyl-1-(prop-2-en-1-ylcarbamoyl)ethyl]carbamate
SMILES CC(C)(C)OC(=O)N[C@@H](Cc1ccccc1)C(=O)NCC=C
InChI Key InChIKey=CGOKANXAZNFJJW-AWEZNQCLSA-N
Data  4 KI
  Tab Delimited (TSV)   2D SDfile   Computed 3D by Vconf -m prep SDfile
Find this compound or compounds like it in BindingDB:
Activity Spreadsheet -- Enzyme Inhibition Constant Data from BindingDB
Found 4 hits for monomerid = 20127
TargetCathepsin S(Homo sapiens (Human))
Rheinische Friedrich-Wilhelms-Universitat Bonn
LigandPNGBDBM20127(phenylalanine derived allylamide, 55 | tert-butyl ...)
Affinity DataKi: >1.00E+5nM. Assay description: Enzyme activities were calculated from kinetic measurements performed by fluorimetric detection of the product AMC at the wavelengths for excitation ...
In DepthDetails ArticlePubMed
TargetPapain(Carica papaya)
Rheinische Friedrich-Wilhelms-Universitat Bonn
LigandPNGBDBM20127(phenylalanine derived allylamide, 55 | tert-butyl ...)
Affinity DataKi:  4.97E+5nM. Assay description: Enzyme activities were calculated from kinetic measurements performed by spectrophotometric detection of the product p-nitroaniline (pNA) at waveleng...
In DepthDetails ArticlePubMed
TargetCathepsin K(Homo sapiens (Human))
Rheinische Friedrich-Wilhelms-Universitat Bonn
LigandPNGBDBM20127(phenylalanine derived allylamide, 55 | tert-butyl ...)
Affinity DataKi: >1.00E+6nM. Assay description: Enzyme activities were calculated from kinetic measurements performed by fluorimetric detection of the product AMC at the wavelengths for excitation ...
In DepthDetails ArticlePubMed
TargetProcathepsin L(Bos taurus (bovine))
Rheinische Friedrich-Wilhelms-Universitat Bonn
LigandPNGBDBM20127(phenylalanine derived allylamide, 55 | tert-butyl ...)
Affinity DataKi: >1.00E+6nM. Assay description: Enzyme activities were calculated from kinetic measurements performed by fluorimetric detection of the product AMC at the wavelengths for excitation ...
In DepthDetails ArticlePubMed