BDBM204829 US9242977, 9
SMILES FC(F)(F)c1cnc(c(NC(=O)Nc2cnc(Oc3ccc(cc3)-c3cnc(s3)N3CCCCC3=O)nc2)c1)-c1ccc(nc1)C(F)(F)F
InChI Key InChIKey=YHGCQMMSHUBAMT-UHFFFAOYSA-N
Data  2 IC50
  Tab Delimited (TSV)   2D SDfile   Computed 3D by Vconf -m prep SDfile
Find this compound or compounds like it in BindingDB:
Activity Spreadsheet -- Enzyme Inhibition Constant Data from BindingDB
Found 2 hits for monomerid = 204829
TargetIsoform TrkA-I of High affinity nerve growth factor receptor (TrkAI)(Homo sapiens (Human))
Ono Pharmaceutical
US Patent
LigandPNGBDBM204829(US9242977, 9)
Affinity DataIC50:  93nM. Assay description: TrkA kinase-inhibiting activity in cell systems was measured using CHO-K1 cells expressing human TrkA and NFAT-bla (CellSenser TrkA-NFAT-bla CHO-K1 c...
Ligand InfoPC cidPC sid
In DepthDetails US Patent
TargetIsoform TrkA-I of High affinity nerve growth factor receptor (TrkAI)(Homo sapiens (Human))
Ono Pharmaceutical
US Patent
LigandPNGBDBM204829(US9242977, 9)
Affinity DataIC50:  160nMpH: 7.5Assay Description:TrkA-inhibiting activity was measured according to the following method using LanthaScreen kinase assay reagents (Invitrogen; Fluorescein-Poly GT, La...
Ligand InfoPC cidPC sid
In DepthDetails US Patent