BDBM205137 3-methyl-2-{[(3r,6r)-6- methyl-1-{[2-(1,3-thiazol-2- yl)phenyl]carbonyl}piperidin- 3-yl]oxy}pyridine-4- carbonitrile::US9546152, example 44
SMILES C[C@@H]1CC[C@H](CN1C(=O)c1ccccc1-c1nccs1)Oc1nccc(C#N)c1C
InChI Key InChIKey=ICHOHAILFUZAEE-CRAIPNDOSA-N
Data  2 KI  2 IC50
  Tab Delimited (TSV)   2D SDfile   Computed 3D by Vconf -m prep SDfile
Find this compound or compounds like it in BindingDB:
Activity Spreadsheet -- Enzyme Inhibition Constant Data from BindingDB
Found 4 hits for monomerid = 205137
TargetOrexin receptor type 2(Homo sapiens (Human))
Merck Sharp & Dohme
US Patent
LigandPNGBDBM205137(3-methyl-2-{[(3r,6r)-6- methyl-1-{[2-(1,3-thiazol-...)
Affinity DataKi:  0.100nM. Assay description: Radioligand binding assay (described in Bergman et. al. Bioorg. Med. Chem. Lett. 2008, 18, 1425-1430) in which the inhibition constant (Ki) is determ...
Ligand InfoPC cidPC sid
In DepthDetails US Patent
TargetOrexin/Hypocretin receptor type 1(Homo sapiens (Human))
Merck Sharp & Dohme
US Patent
LigandPNGBDBM205137(3-methyl-2-{[(3r,6r)-6- methyl-1-{[2-(1,3-thiazol-...)
Affinity DataKi:  64nM. Assay description: Radioligand binding assay (described in Bergman et. al. Bioorg. Med. Chem. Lett. 2008, 18, 1425-1430) in which the inhibition constant (Ki) is determ...
Ligand InfoPC cidPC sid
In DepthDetails US Patent
TargetOrexin receptor type 2(Homo sapiens (Human))
Merck Sharp & Dohme
US Patent
LigandPNGBDBM205137(3-methyl-2-{[(3r,6r)-6- methyl-1-{[2-(1,3-thiazol-...)
Affinity DataIC50:  8nM. Assay description: The utility of the compounds in accordance with the present invention as orexin receptor OX1R and/or OX2R antagonists may be readily determined witho...
Ligand InfoPC cidPC sid
In DepthDetails US Patent
TargetOrexin/Hypocretin receptor type 1(Homo sapiens (Human))
Merck Sharp & Dohme
US Patent
LigandPNGBDBM205137(3-methyl-2-{[(3r,6r)-6- methyl-1-{[2-(1,3-thiazol-...)
Affinity DataIC50:  361nM. Assay description: The utility of the compounds in accordance with the present invention as orexin receptor OX1R and/or OX2R antagonists may be readily determined witho...
Ligand InfoPC cidPC sid
In DepthDetails US Patent