BDBM205256 US9249125, 9
SMILES COc1ccc(cc1)-n1nc(cc1NC(=O)Nc1ccc(Oc2ccnc(Nc3cc(C)c4[nH]ncc4c3)n2)c2ccccc12)C(C)C
InChI Key InChIKey=CCRFXSGDDYALRL-UHFFFAOYSA-N
Data  4 IC50
  Tab Delimited (TSV)   2D SDfile   Computed 3D by Vconf -m prep SDfile
Find this compound or compounds like it in BindingDB:
Activity Spreadsheet -- Enzyme Inhibition Constant Data from BindingDB
Found 4 hits for monomerid = 205256
TargetProto-oncogene tyrosine-protein kinase Src(Homo sapiens (Human))
Respivert
US Patent
LigandPNGBDBM205256(US9249125, 9)
Affinity DataIC50:  4nM. Assay description: The inhibitory activities of compounds of the invention against c-Src and Syk enzymes (Invitrogen), are evaluated in a similar fashion to that descri...
Ligand InfoPC cidPC sid
In DepthDetails US Patent
TargetMitogen-activated protein kinase 14(Homo sapiens (Human))
Respivert
US Patent
LigandPNGBDBM205256(US9249125, 9)
Affinity DataIC50:  38nM. Assay description: The inhibitory activities of test compounds against the p38 MAPKα isoform (MAPK14: Invitrogen), are evaluated indirectly by determining the l...
Ligand InfoPC cidPC sid
In DepthDetails US Patent
TargetGlycogen synthase kinase-3 alpha(Homo sapiens (Human))
Respivert
US Patent
LigandPNGBDBM205256(US9249125, 9)
Affinity DataIC50: >1.56E+4nM. Assay description: The inhibitory activities of compounds of the invention against the GSK 3α enzyme isoform (Invitrogen), are evaluated by determining the level ...
Ligand InfoPC cidPC sid
In DepthDetails US Patent
TargetTyrosine-protein kinase SYK(Homo sapiens (Human))
Respivert
US Patent
LigandPNGBDBM205256(US9249125, 9)
Affinity DataIC50:  7nM. Assay description: The inhibitory activities of compounds of the invention against c-Src and Syk enzymes (Invitrogen), are evaluated in a similar fashion to that descri...
Ligand InfoPC cidPC sid
In DepthDetails US Patent