BDBM206343 US9259470, 167
SMILES Cc1nn(C)cc1Nc1nccc(n1)-c1ccn([C@H](CO)c2ccc(Cl)c(F)c2)c(=O)c1
InChI Key InChIKey=OALGIVXCUSEONF-HXUWFJFHSA-N
Data  5 IC50
  Tab Delimited (TSV)   2D SDfile   Computed 3D by Vconf -m prep SDfile
Find this compound or compounds like it in BindingDB:
Activity Spreadsheet -- Enzyme Inhibition Constant Data from BindingDB
Found 5 hits for monomerid = 206343
TargetMitogen-activated protein kinase 1(Homo sapiens (Human))
Array Biopharma
US Patent
LigandPNGBDBM206343(US9259470, 167)
Affinity DataIC50:  3.10nMpH: 7.3Assay Description:Compounds were tested in an enzymatic assay using human ERK-2 (Mitogen Activated Kinase 1), recombinantly expressed as an n-terminal 6-His fusion pro...
Ligand InfoPC cidPC sid
In DepthDetails US Patent
TargetMitogen-activated protein kinase 3(Homo sapiens (Human))
Array Biopharma
Curated by ChEMBL
LigandPNGBDBM206343(US9259470, 167)
Affinity DataIC50:  13nM. Assay description: Inhibition of ERK1 (unknown origin)
Ligand InfoPC cidPC sid
In DepthDetails ArticlePubMed
TargetMitogen-activated protein kinase 1(Homo sapiens (Human))
Array Biopharma
US Patent
LigandPNGBDBM206343(US9259470, 167)
Affinity DataIC50:  5.90nM. Assay description: Inhibition of ERK2 (unknown origin)
Ligand InfoPC cidPC sid
In DepthDetails ArticlePubMed
TargetMitogen-activated protein kinase 3(Homo sapiens (Human))
Array Biopharma
Curated by ChEMBL
LigandPNGBDBM206343(US9259470, 167)
Affinity DataIC50:  13nM. Assay description: Inhibition of ERK1 (unknown origin)
Ligand InfoPC cidPC sid
In DepthDetails ArticlePubMed
TargetMitogen-activated protein kinase 1(Homo sapiens (Human))
Array Biopharma
US Patent
LigandPNGBDBM206343(US9259470, 167)
Affinity DataIC50:  5.90nM. Assay description: Inhibition of ERK2 (unknown origin)
Ligand InfoPC cidPC sid
In DepthDetails ArticlePubMed