BDBM21109 3-{4-[3-amino-7-(trifluoromethoxy)-1,2-benzoxazol-4-yl]phenyl}-1-(2-fluoro-5-methylphenyl)urea::Aminobenzoisoxazole, 55
SMILES Cc1ccc(F)c(NC(=O)Nc2ccc(cc2)-c2ccc(OC(F)(F)F)c3onc(N)c23)c1
InChI Key InChIKey=SKANDNUVNSHDDS-UHFFFAOYSA-N
Data  3 IC50  1 EC50
  Tab Delimited (TSV)   2D SDfile   Computed 3D by Vconf -m prep SDfile
Find this compound or compounds like it in BindingDB:
Activity Spreadsheet -- Enzyme Inhibition Constant Data from BindingDB
Found 3 hits for monomerid = 21109
TargetMast/stem cell growth factor receptor Kit(Homo sapiens (Human))
Abbott Laboratories
LigandPNGBDBM21109(3-{4-[3-amino-7-(trifluoromethoxy)-1,2-benzoxazol-...)
Affinity DataIC50:  294nM. Assay description: The assay uses purified enzyme interacting with biotinylated peptide substrate. HTRF is based on the proximity of europium cryptate (donor fluorophor...
In DepthDetails ArticlePubMed
TargetVascular endothelial growth factor receptor 2(Homo sapiens (Human))
Abbott Laboratories
LigandPNGBDBM21109(3-{4-[3-amino-7-(trifluoromethoxy)-1,2-benzoxazol-...)
Affinity DataIC50:  158nM EC50:  179nM. Assay description: The assay uses purified enzyme interacting with biotinylated peptide substrate. HTRF is based on the proximity of europium cryptate (donor fluorophor...
In DepthDetails ArticlePubMed
TargetAromatase(Homo sapiens (Human))
Abbott Laboratories
LigandPNGBDBM21109(3-{4-[3-amino-7-(trifluoromethoxy)-1,2-benzoxazol-...)
Affinity DataIC50:  58nM. Assay description: The assay uses purified enzyme interacting with biotinylated peptide substrate. HTRF is based on the proximity of europium cryptate (donor fluorophor...
In DepthDetails ArticlePubMed