BDBM213718 US9284284, 9
SMILES NC1=N[C@](COC1)(C(F)F)c1cc(Nc2nccc3cc(cnc23)C#N)ccc1F
InChI Key InChIKey=AYBCGPRPLJRSKE-FQEVSTJZSA-N
Data  2 IC50
  Tab Delimited (TSV)   2D SDfile   Computed 3D by Vconf -m prep SDfile
Find this compound or compounds like it in BindingDB:
Activity Spreadsheet -- Enzyme Inhibition Constant Data from BindingDB
Found 2 hits for monomerid = 213718
TargetBeta-secretase 2(Homo sapiens (Human))
Novartis
US Patent
LigandPNGBDBM213718(US9284284, 9)
Affinity DataIC50:  30nMpH: 4.5 T: 2°C. Assay description: Recombinant BACE-2 (extracellular domain, expressed in baculovirus and purified using standard methods) at 0.1 to 1 nM concentrations is incubated wi...
Ligand InfoPC cidPC sid
In DepthDetails US Patent
TargetBeta-secretase 1(Homo sapiens (Human))
Novartis
US Patent
LigandPNGBDBM213718(US9284284, 9)
Affinity DataIC50:  18nMpH: 4.5 T: 2°C. Assay description: Recombinant BACE-1 (extracellular domain, expressed in baculovirus and purified using standard methods) at 0.1 to 1 nM concentrations is incubated wi...
Ligand InfoPC cidPC sid
In DepthDetails US Patent