BDBM221359 US9303023, 55
SMILES COc1ccc(cc1)-c1ocnc1C(=O)Nc1cnn(CCNc2nc(OC)cc(OC)n2)c1
InChI Key InChIKey=AGTYLUDFLBJZNF-UHFFFAOYSA-N
Data  1 IC50
  Tab Delimited (TSV)   2D SDfile   Computed 3D by Vconf -m prep SDfile
Find this compound or compounds like it in BindingDB:
Activity Spreadsheet -- Enzyme Inhibition Constant Data from BindingDB
Found 1 hit for monomerid = 221359
TargetOrexin receptor type 2(Homo sapiens (Human))
Actelion Pharmaceuticals
US Patent
LigandPNGBDBM221359(US9303023, 55)
Affinity DataIC50:  100nMT: 2°C. Assay description: Chinese hamster ovary (CHO) cells expressing the human orexin-1 receptor and the human orexin-2 receptor, respectively, are grown in culture medium (...
Ligand InfoPC cidPC sid
In DepthDetails US Patent