BDBM222204 N'-(4-(5-(2-methoxyphenyl)-1,3,4-oxadiazol-2-yl)benzoyl)-3-nitrobenzenesulfonohydrazide (12)
SMILES COc1ccccc1-c1nnc(o1)-c1ccc(cc1)C(=O)NNS(=O)(=O)c1cccc(c1)[N+]([O-])=O
InChI Key InChIKey=NHIFVRFJCPEIAY-UHFFFAOYSA-N
Data  1 IC50
  Tab Delimited (TSV)   2D SDfile   Computed 3D by Vconf -m prep SDfile
Find this compound or compounds like it in BindingDB:
Activity Spreadsheet -- Enzyme Inhibition Constant Data from BindingDB
Found 1 hit for monomerid = 222204
TargetBeta-glucuronidase(Homo sapiens (Human))
Universiti Teknologi Mara (Uitm)
LigandPNGBDBM222204(N'-(4-(5-(2-methoxyphenyl)-1,3,4-oxadiazol-2-y...)
Affinity DataIC50:  8.93E+4nM. Assay description: β-glucuronidase activity was determined by measuring absorbance at 405 nm of p-nitrophenol formed substrate by spectrophotometric method. 250 &#...
Ligand InfoPC cidPC sid
In DepthDetails ArticlePubMed