BDBM223011 US10034939, Example 13::US10967060, Example 13::US11207302, Example 13::US9320732, 13::US9789094, 13
SMILES NS(=O)(=O)NCCNc1nonc1C(Nc1cccc(c1)C(F)(F)F)=NO
InChI Key InChIKey=XWCIZKDALWTABF-UHFFFAOYSA-N
Data  6 IC50
  Tab Delimited (TSV)   2D SDfile   Computed 3D by Vconf -m prep SDfile
Find this compound or compounds like it in BindingDB:
Activity Spreadsheet -- Enzyme Inhibition Constant Data from BindingDB
Found 6 hits for monomerid = 223011
TargetIndoleamine 2,3-dioxygenase 1(Homo sapiens (Human))
Incyte
US Patent
LigandPNGBDBM223011(US10034939, Example 13 | US10967060, Example 13 | ...)
Affinity DataIC50: <500nMpH: 6.5 T: 2°C. Assay description: Human indoleamine 2,3-dioxygenasae (IDO) with an N-terminal His tag was expressed in E. coli and purified to homogeneity. IDO catalyzes the oxidative...
Ligand InfoPC cidPC sid
In DepthDetails US Patent
TargetIndoleamine 2,3-dioxygenase 1(Homo sapiens (Human))
Incyte
US Patent
LigandPNGBDBM223011(US10034939, Example 13 | US10967060, Example 13 | ...)
Affinity DataIC50: <500nMpH: 6.5 T: 2°C. Assay description: Human indoleamine 2,3-dioxygenasae (IDO) with an N-terminal His tag was expressed in E. coli and purified to homogeneity. IDO catalyzes the oxidative...
Ligand InfoPC cidPC sid
In DepthDetails US Patent
TargetIndoleamine 2,3-dioxygenase 1(Homo sapiens (Human))
Incyte
US Patent
LigandPNGBDBM223011(US10034939, Example 13 | US10967060, Example 13 | ...)
Affinity DataIC50: <500nM. Assay description: Human indoleamine 2,3-dioxygenasae (IDO) with an N-terminal His tag was expressed in E. coli and purified to homogeneity. IDO catalyzes the oxidative...
Ligand InfoPC cidPC sid
In DepthDetails US Patent
TargetIndoleamine 2,3-dioxygenase 1(Homo sapiens (Human))
Incyte
US Patent
LigandPNGBDBM223011(US10034939, Example 13 | US10967060, Example 13 | ...)
Affinity DataIC50: <500nM. Assay description: Human indoleamine 2,3-dioxygenasae (IDO) with an N-terminal His tag was expressed in E. coli and purified to homogeneity. IDO catalyzes the oxidative...
Ligand InfoPC cidPC sid
In DepthDetails US Patent
TargetIndoleamine 2,3-dioxygenase 1(Homo sapiens (Human))
Incyte
US Patent
LigandPNGBDBM223011(US10034939, Example 13 | US10967060, Example 13 | ...)
Affinity DataIC50: <500nM. Assay description: Human indoleamine 2,3-dioxygenasae (IDO) with an N-terminal His tag was expressed in E. coli and purified to homogeneity. IDO catalyzes the oxidative...
Ligand InfoPC cidPC sid
In DepthDetails US Patent
TargetIndoleamine 2,3-dioxygenase 1(Homo sapiens (Human))
Incyte
US Patent
LigandPNGBDBM223011(US10034939, Example 13 | US10967060, Example 13 | ...)
Affinity DataIC50: <500nMpH: 6.5 T: 2°C. Assay description: Human indoleamine 2,3-dioxygenasae (IDO) with an N-terminal His tag was expressed in E. coli and purified to homogeneity. IDO catalyzes the oxidative...
Ligand InfoPC cidPC sid
In DepthDetails US Patent