BDBM223307 123C3
SMILES NCCCC(=O)N[C@@H](Cc1c[nH]c2ccc(O)cc12)C(=O)N[C@@H](Cc1ccc(Cl)cc1)C(=O)N[C@@H](Cc1ccncc1)C(=O)NCCc1c[nH]c2ccc(F)cc12
InChI Key
Data  1 KI
  Tab Delimited (TSV)   2D SDfile   Computed 3D by Vconf -m prep SDfile
Find this compound or compounds like it in BindingDB:
Activity Spreadsheet -- Enzyme Inhibition Constant Data from BindingDB
Found 1 hit for monomerid = 223307
TargetEphrin type-A receptor 4 [29-209](Homo sapiens (Human))
Sanford Burnham Prebys Medical Discovery Institute
LigandPNGBDBM223307(123C3)
Affinity DataKi:  2.22E+3nM ΔG°:  -7.71kcal/molepH: 7.2 T: 2°C. Assay description: For competitive binding assays, 1 mL of 200 mM EphA4-LBD was pre-incubated with the tested compounds at various concentrations in 98 mL of PBS (pH 7....
Ligand InfoPC cidPC sid
In DepthDetails ArticlePubMed