BDBM225232 S-methylglutathione
SMILES CSC[C@H](NC(=O)CC[C@H](N)C(O)=O)C(=O)NCC(O)=O
InChI Key InChIKey=QTQDDTSVRVWHMO-BQBZGAKWSA-N
Data  1 KI  3 Kd
PDB links: 3 PDB IDs match this monomer.
  Tab Delimited (TSV)   2D SDfile   Computed 3D by Vconf -m prep SDfile
Find this compound or compounds like it in BindingDB:
Activity Spreadsheet -- Enzyme Inhibition Constant Data from BindingDB
Found 3 hits for monomerid = 225232
TargetHbpA(Pasteurella multocida)
Ghent University
LigandPNGBDBM225232(S-methylglutathione)
Affinity DataKd:  550nMpH: 7.4 T: 2°C. Assay description: Experiments were carried out using a VP-ITC MicroCalorimeter (MicroCal) at 37°C, and data were analyzed using the Origen ITC analysis software packag...
In DepthDetails ArticlePubMed
TargetHeme-binding protein A(Actinobacillus pleuropneumoniae)
Ghent University
LigandPNGBDBM225232(S-methylglutathione)
Affinity DataKd:  1.17E+3nMpH: 7.4 T: 2°C. Assay description: Experiments were carried out using a VP-ITC MicroCalorimeter (MicroCal) at 37°C, and data were analyzed using the Origen ITC analysis software packag...
In DepthDetails ArticlePubMed
TargetHeme-binding protein A(Haemophilus parasuis)
Ghent University
LigandPNGBDBM225232(S-methylglutathione)
Affinity DataKd:  900nMpH: 7.4 T: 2°C. Assay description: Experiments were carried out using a VP-ITC MicroCalorimeter (MicroCal) at 37°C, and data were analyzed using the Origen ITC analysis software packag...
In DepthDetails ArticlePubMed