BDBM225310 CS1
SMILES Cc1cc(NC(=O)c2ccc(Br)cc2)n[nH]1
InChI Key InChIKey=PXLNCBTUYNESDD-UHFFFAOYSA-N
Data  2 Kd  2 Koff  2 Kon  2 ITC
PDB links: 1 PDB ID matches this monomer.
  Tab Delimited (TSV)   2D SDfile   Computed 3D by Vconf -m prep SDfile
Find this compound or compounds like it in BindingDB:
Activity Spreadsheet -- Enzyme Inhibition Constant Data from BindingDB
Found 6 hits for monomerid = 225310
TargetCyclin-dependent kinase 2(Homo sapiens (Human))
D3R/Abbott
LigandPNGBDBM225310(CS1)
Affinity DataKd:  4.09E+3nM. Assay description: OctetRed_Method2
Ligand InfoPC cidPC sidPDB
TargetCyclin-dependent kinase 2(Homo sapiens (Human))
D3R/Abbott
LigandPNGBDBM225310(CS1)
Affinity DataKoff:  2.26E+6s-1Assay Description:OctetRed_Method3
Ligand InfoPC cidPC sidPDB
TargetCyclin-dependent kinase 2(Homo sapiens (Human))
D3R/Abbott
LigandPNGBDBM225310(CS1)
Affinity DataKon:  1.09M-1s-1Assay Description:OctetRed_Method3
Ligand InfoPC cidPC sidPDB
TargetCyclin-dependent kinase 2(Homo sapiens (Human))
D3R/Abbott
LigandPNGBDBM225310(CS1)
Affinity DataKd:  3.32E+4nM. Assay description: OctetRed_Method1
Ligand InfoPC cidPC sidPDB
TargetCyclin-dependent kinase 2(Homo sapiens (Human))
D3R/Abbott
LigandPNGBDBM225310(CS1)
Affinity DataKoff:  3.57E+4s-1Assay Description:OctetRed_Method3
Ligand InfoPC cidPC sidPDB
TargetCyclin-dependent kinase 2(Homo sapiens (Human))
D3R/Abbott
LigandPNGBDBM225310(CS1)
Affinity DataKon:  3.15M-1s-1Assay Description:OctetRed_Method3
Ligand InfoPC cidPC sidPDB
Activity Spreadsheet -- ITC Data from BindingDB
Found 2 hits for monomerid = 225310
CellCyclin-dependent kinase 2(Homo sapiens (Human))
D3R/Abbott
SyringePNGBDBM225310(CS1)
ITC DataΔG°: -7.24kcal/mole −TΔS°: -14.6kcal/mole ΔH°: -3.73kcal/mole logk: 2.05E+5
T: 24.85°C
Syringe InfoPC cidPC sidPDB
CellCyclin-dependent kinase 2(Homo sapiens (Human))
D3R/Abbott
SyringePNGBDBM225310(CS1)
ITC DataΔG°: -6.52kcal/mole −TΔS°: 1.00kcal/mole ΔH°: -7.52kcal/mole logk: 6.10E+4
T: 24.85°C
Syringe InfoPC cidPC sidPDB